acceso embargado
alternative label: accès sous embargo @fr
alternative label: libre accès après durée d'embargo @fr
preferred label: accesso sottoposto a periodo di embargo @it
preferred label: odlog javne objave @sl
top concept of: Access Rights
type: Concept
alternative label: deposito oscuro
preferred label: ambargolu erişim @tr
alternative label: acesso sob embargo @pt
preferred label: Zugang unterliegt Embargo @de
alternative label: accès libre retardé @fr
preferred label: odloženi otvoreni pristup @sr
alternative label: dostop z embargom @sl
preferred label: доступ с эмбарго @ru
preferred label: accés embargat @ca
in scheme: Access Rights
preferred label: sous embargo @fr
preferred label: embargo @fi
alternative label: libre accès différé @fr
preferred label: onder embargo @nl
alternative label: acceso bajo periodo de embargo
alternative label: depósito oscuro
preferred label: acesso embargado @pt
preferred label: одложени отворени приступ @sr-cyrl
alternative label: acceso bajo período de embargo
alternative label: acceso con periodo de embargo
definition: Embargoed access refers to a resource that is metadata only access until released for open access on a certain date. Embargoes can be required by publishers and funders policies, or set by the author (e.g such as in the case of theses and dissertations). @en
preferred label: الوصول المحظور @ar
preferred label: エンバーゴ有 @ja
alternative label: acceso con periodo de carencia
preferred label: odložené zpřístupnění @cs
editorial note: Published @en
preferred label: embargoed access @en

acceso abierto
editorial note: Published @en
preferred label: acesso aberto @pt
preferred label: open access @en
related match: OpenAccess
alternative label: acceso abierto gratuito
preferred label: offener Zugang @de
preferred label: الوصول الحر @ar
top concept of: Access Rights
alternative label: acceso público
preferred label: отворени приступ @sr-cyrl
alternative label: acesso livre @pt
alternative label: accès libre @fr
definition: Open access refers to a resource that is immediately and permanently online, and free for all on the Web, without financial and technical barriers.The resource is either stored in the repository or referenced to an external journal or trustworthy archive. @en
type: Concept
preferred label: otvoreni pristup @sr
preferred label: accesso aperto @it
alternative label: accès ouvert @fr
alternative label: бесплатный доступ @ru
in scheme: Access Rights
related match: public
preferred label: otevřený přístup @cs
preferred label: accés obert @ca
alternative label: vapaa pääsy @fi
preferred label: libre accès @fr
preferred label: オープンアクセス @ja
preferred label: vrij toegankelijk @nl
alternative label: vrij beschikbaar @nl
preferred label: açık erişim @tr
preferred label: odprti dostop @sl
preferred label: avoin saatavuus @fi
preferred label: открытый доступ @ru
alternative label: freier Zugang @de

registro bibliográfico
related match: ClosedAccess
preferred label: メタデータのみ @ja
definition: Metadata only access refers to a resource in which access is limited to metadata only. The resource itself is described by the metadata, but neither is directly available through the system or platform nor can be referenced to an open access copy in an external journal or trustworthy archive. @en
alternative label: acesso limitado a metadados @pt
alternative label: acceso a metadatos solamente
alternative label: accès restreint aux métadonnées @fr
preferred label: доступ к метаданным @ru
preferred label: pouze metadata @cs
preferred label: accesso limitato ai metadati @it
alternative label: alleen metadata @nl
alternative label: accès uniquement aux métadonnées @fr
top concept of: Access Rights
preferred label: metadata only access @en
preferred label: الوصول المحدود بالميتاداتا @ar
preferred label: accés només a metadades @ca
alternative label: acceso a registro bibliográfico
preferred label: pristup ograničen na metapodatke @sr
in scheme: Access Rights
preferred label: nur Metadaten @de
type: Concept
alternative label: registro bibliografico
preferred label: samo metapodatki @sl
preferred label: приступ ограничен на метаподатке @sr-cyrl
preferred label: acesso a metadados @pt
alternative label: acceso a metadatos
preferred label: vain metadata saatavissa @fi
preferred label: alleen metadata beschikbaar @nl
preferred label: accès aux seules métadonnées @fr
alternative label: samo dostop do metapodatkov @sl
alternative label: sadece metadata erişimi @tr
alternative label: acceso a registro bibliografico
editorial note: Published @en
preferred label: sadece üstveri erişimi @tr
alternative label: accès limité aux métadonnées @fr
alternative label: libre accès aux seules métadonnées @fr

acceso restringido
alternative label: accès aux abonnés @fr
related match: restricted
alternative label: acceso gratuito mediado
alternative label: pristup s lozinkom @sr
preferred label: アクセス制限有 @ja
alternative label: acceso bajo restricciones
alternative label: acceso con limitaciones
preferred label: accesso riservato @it
alternative label: приступ с лозинком @sr-cyrl
top concept of: Access Rights
type: Concept
preferred label: ограничени приступ @sr-cyrl
alternative label: kısıtlı erişim @tr
alternative label: rajoitettu pääsy @fi
preferred label: accès réservé @fr
alternative label: acceso gratuito bajo restricciones
in scheme: Access Rights
preferred label: eingeschränkter Zugang @de
alternative label: accès limité @fr
preferred label: ograničeni pristup @sr
preferred label: acesso restrito @pt
definition: Restricted access refers to a resource that is available in a system but with some type of restriction for full open access. This type of access can occur in a number of different situations. Some examples are described below: The user must log-in to the system in order to access the resource The user must send an email to the author or system administrator to access the resource Access to the resource is restricted to a specific community (e.g. limited to a university community) @en
related match: RestrictedAccess
preferred label: rajoitettu saatavuus @fi
preferred label: restricted access @en
preferred label: omezený přístup @cs
preferred label: omejen dostop @sl
preferred label: الوصول المقيد @ar
preferred label: sınırlı erişim @tr
alternative label: beperkte toegang @nl
preferred label: ограниченный доступ @ru
alternative label: accès restreint @fr
preferred label: accés restringit @ca
editorial note: Published @en
preferred label: beperkt toegankelijk @nl
alternative label: acceso bajo condiciones
alternative label: accès sous condition @fr

Access Rights
type: ConceptScheme
has top concept: acceso abierto
has top concept: registro bibliográfico
modified: 2025-11-06T15:09:43+00:00
has top concept: acceso embargado
has top concept: acceso restringido
description: The Access Rights vocabulary defines concepts to declare the access status of a resource. Multilingual labels regard regional distinctions in language and term.
creator: Alberto Apollaro
creator: Sophie Aubin
creator: Cristina Azorín
creator: Paola Azrilevich
creator: Isabel Bernal
creator: Dan Liu
creator: Dom Fripp
creator: Gültekin Gürdal
creator: Sawsan Habre
creator: Juha Hakala
creator: Yutaka Hayashi
creator: Ilkay Holt
creator: Nie Hua
creator: Hilary Jones
creator: Tomoko Kataoka
creator: Pavel Kotlík
creator: Laurence Le Borgne
creator: Ku (Alan) Liping
creator: Marina Losada
creator: Susanna Mornati
creator: Brigit Nonó
creator: Milan Ojsteršek
creator: Pedro Príncipe
creator: Jochen Schirrwagen
creator: Milica Sevkusic
creator: Tomoya Shiota
creator: Iryna Solodovnik
creator: Wilko Steinhoff
creator: Nathalie Vedovotto
contributor: COAR Controlled Vocabularies Interest Group